Target
Estrogen receptor
Ligand
BDBM50154057
Substrate
Meas. Tech.
ChEMBL_306421 (CHEMBL828092)
IC50
1295±n/a nM
Citation
 Malamas, MSManas, ESMcDevitt, REGunawan, IXu, ZBCollini, MDMiller, CPDinh, THenderson, RAKeith, JCHarris, HA Design and synthesis of aryl diphenolic azoles as potent and selective estrogen receptor-beta ligands. J Med Chem 47:5021-40 (2004)  
Target
Name:
Estrogen receptor
Synonyms:
ESR1_RAT Esr1 Nr3a1 | estrogen alpha
Type:
Enzyme Catalytic Domain
Mol. Mass.:
67045.89
Organism:
RAT
Description:
estrogen alpha 0 RAT::P06211
Residue:
600
  
Inhibitor
Name:
BDBM50154057
Synonyms:
2-(4-Hydroxy-phenyl)-benzooxazol-5-ol CHEMBL187392
Type:
Small organic molecule
Emp. Form.:
C13H9NO3
Mol. Mass.:
227.2155
SMILES:
Oc1ccc(cc1)-c1nc2cc(O)ccc2o1
: