Target
Poly [ADP-ribose] polymerase 1
Ligand
BDBM50154735
Substrate
Meas. Tech.
ChEMBL_302465 (CHEMBL826331)
Ki
9.4±n/a nM
Citation
 Tikhe, JGWebber, SEHostomsky, ZMaegley, KAEkkers, ALi, JYu, XHAlmassy, RJKumpf, RABoritzki, TJZhang, CCalabrese, CRCurtin, NJKyle, SThomas, HDWang, LZCalvert, AHGolding, BTGriffin, RJNewell, DR Design, synthesis, and evaluation of 3,4-dihydro-2H-[1,4]diazepino[6,7,1-hi]indol-1-ones as inhibitors of poly(ADP-ribose) polymerase. J Med Chem 47:5467-81 (2004)  
Target
Name:
Poly [ADP-ribose] polymerase 1
Synonyms:
(ARTD1 or PARP1) 2.4.2.30 ADPRT ARTD1 Human diphtheria toxin-like ADP-ribosyltransferase (ARTD1 or PARP1) NT-PARP-1 PARP1 PPOL Poly [ADP-ribose] polymerase 1 (PARP) Poly [ADP-ribose] polymerase 1 (PARP1) Poly [ADP-ribose] polymerase 1, 28-kDa form Poly [ADP-ribose] polymerase 1, processed C-terminus Poly [ADP-ribose] polymerase-1 Poly(ADP-ribose) polymerase-1 (ARTD1/PARP1) Protein poly-ADP-ribosyltransferase PARP1 | Synonyms=ADPRT
Type:
Mol. Mass.:
113114.22
Organism:
Homo sapiens (Human)
Description:
P09874
Residue:
1014
  
Inhibitor
Name:
BDBM50154735
Synonyms:
1-Oxo-1,2,3,4-tetrahydro-[1,4]diazepino[6,7,1-hi]indole-7-carbaldehyde oxime | CHEMBL189698
Type:
Small organic molecule
Emp. Form.:
C12H11N3O2
Mol. Mass.:
229.2346
SMILES:
O=NCc1cn2CCNC(=O)c3cccc1c23
: