Target
Metabotropic glutamate receptor 5
Ligand
BDBM50154995
Substrate
Meas. Tech.
ChEMBL_312890 (CHEMBL826438)
IC50
956.0±n/a nM
Citation
 Poon, SFEastman, BWChapman, DFChung, JCramer, MHoltz, GCosford, NDSmith, ND 3-[3-Fluoro-5-(5-pyridin-2-yl-2H-tetrazol-2-yl)phenyl]-4-methylpyridine: a highly potent and orally bioavailable metabotropic glutamate subtype 5 (mGlu5) receptor antagonist. Bioorg Med Chem Lett 14:5477-80 (2004)  
Target
Name:
Metabotropic glutamate receptor 5
Synonyms:
GRM5_RAT Grm5 Mglur5 metabotropic glutamate 5/1-C metabotropic glutamate 5a
Type:
Enzyme
Mol. Mass.:
131900.14
Organism:
Rattus norvegicus (Rat)
Description:
P31424
Residue:
1203
  
Inhibitor
Name:
BDBM50154995
Synonyms:
2-[2-(3-fluoro-5-pyridin-4-ylphenyl)-2H-tetrazol-5-yl]pyridine | CHEMBL187746
Type:
Small organic molecule
Emp. Form.:
C17H11FN6
Mol. Mass.:
318.3078
SMILES:
Fc1cc(cc(c1)-n1nnc(n1)-c1ccccn1)-c1ccncc1
: