Target
Metabotropic glutamate receptor 5
Ligand
BDBM50154981
Substrate
Meas. Tech.
ChEMBL_312478 (CHEMBL833227)
IC50
54±n/a nM
Citation
 Eastman, BChen, CSmith, NDPoon, SChung, JReyes-Manalo, GCosford, NDMunoz, B Expedited SAR study of an mGluR5 antagonists: generation of a focused library using a solution-phase Suzuki coupling methodology. Bioorg Med Chem Lett 14:5485-8 (2004)  
Target
Name:
Metabotropic glutamate receptor 5
Synonyms:
GPRC1E GRM5_HUMAN metabotropic glutamate 5 | metabotropic glutamate 5a
Type:
Enzyme
Mol. Mass.:
132484.72
Organism:
Homo sapiens (Human)
Description:
Residue:
1212
  
Inhibitor
Name:
BDBM50154981
Synonyms:
2-[2-(3-fluoro-5-pyridin-3-ylphenyl)-2H-tetrazol-5-yl]pyridine CHEMBL365083
Type:
Small organic molecule
Emp. Form.:
C17H11FN6
Mol. Mass.:
318.3078
SMILES:
Fc1cc(cc(c1)-n1nnc(n1)-c1ccccn1)-c1cccnc1
: