Target
Histamine H1 receptor
Ligand
BDBM50073179
Substrate
Meas. Tech.
ChEMBL_302919 (CHEMBL830379)
Ki
0.97±n/a nM
Citation
 Lewis, TAYoung, MAArrington, MPBayless, LCai, XCollart, PEckman, JBEllis, JLEne, DGLibertine, LNicolas, JMScannell, RTWels, BFWenberg, KWypij, DM Cetirizine and loratadine-based antihistamines with 5-lipoxygenase inhibitory activity. Bioorg Med Chem Lett 14:5591-4 (2004)  
Target
Name:
Histamine H1 receptor
Synonyms:
H1R HISTAMINE H1 HRH1_HUMAN
Type:
G Protein-Coupled Receptor (GPCR)
Mol. Mass.:
55808.72
Organism:
Homo sapiens (Human)
Description:
Cell pellets from SK-N-MC cells transfected with human H1 receptor were used in binding assay.
Residue:
487
  
Inhibitor
Name:
BDBM50073179
Synonyms:
8-Chloro-11-piperidin-4-ylidene-6,11-dihydro-5H-benzo[5,6]cyclohepta[1,2-b]pyridine Clarinex Claritin-D SCH-34117 US9333199, DESLORATADINE (Clarinex)
Type:
Small organic molecule
Emp. Form.:
C19H19ClN2
Mol. Mass.:
310.821
SMILES:
Clc1ccc2c(-[#6]-[#6]-c3cccnc3\[#6]-2=[#6]-2/[#6]-[#6]-[#7]-[#6]-[#6]-2)c1
: