Target
Polyunsaturated fatty acid 5-lipoxygenase
Ligand
BDBM50155335
Substrate
Meas. Tech.
ChEMBL_304944 (CHEMBL826973)
IC50
96±n/a nM
Citation
 Lewis, TAYoung, MAArrington, MPBayless, LCai, XCollart, PEckman, JBEllis, JLEne, DGLibertine, LNicolas, JMScannell, RTWels, BFWenberg, KWypij, DM Cetirizine and loratadine-based antihistamines with 5-lipoxygenase inhibitory activity. Bioorg Med Chem Lett 14:5591-4 (2004)  
Target
Name:
Polyunsaturated fatty acid 5-lipoxygenase
Synonyms:
5-LO 5-Lipoxygenase (5-LO) 5-Lipoygenase ALOX5 LOG5 | LOX5_HUMAN
Type:
Enzyme
Mol. Mass.:
77972.74
Organism:
Homo sapiens (Human)
Description:
Recombinant protein was purified from E. coli lysate. After ammonium sulfate precipitation and subsequent steps, the supernatant (S100) was used for 5-LO activity assay.
Residue:
674
  
Inhibitor
Name:
BDBM50155335
Synonyms:
1-{4-[4-(3-{4-[(R)-(4-chlorophenyl)(phenyl)methyl]piperazin-1-yl}propoxy)phenyl]but-3-yn-1-yl}-1-hydroxyurea | CHEMBL187264
Type:
Small organic molecule
Emp. Form.:
C31H35ClN4O3
Mol. Mass.:
547.088
SMILES:
NC(=O)N(O)CCC#Cc1ccc(OCCCN2CCN(CC2)[C@H](c2ccccc2)c2ccc(Cl)cc2)cc1
: