Target
Telomerase reverse transcriptase
Ligand
BDBM50155661
Substrate
Meas. Tech.
ChEMBL_304144 (CHEMBL840260)
EC50
200±n/a nM
Citation
 Harrison, RJReszka, APHaider, SMRomagnoli, BMorrell, JRead, MAGowan, SMIncles, CMKelland, LRNeidle, S Evaluation of by disubstituted acridone derivatives as telomerase inhibitors: the importance of G-quadruplex binding. Bioorg Med Chem Lett 14:5845-9 (2004)  
Target
Name:
Telomerase reverse transcriptase
Synonyms:
EST2 TERT TRT
Type:
PROTEIN
Mol. Mass.:
127099.03
Organism:
Homo sapiens (Human)
Description:
ChEMBL_1447029
Residue:
1132
  
Inhibitor
Name:
BDBM50155661
Synonyms:
3-(4-Methyl-piperidin-1-yl)-N-{6-[3-(4-methyl-piperidin-1-yl)-propionylamino]-9-oxo-9,10-dihydro-acridin-2-yl}-propionamide CHEMBL361868
Type:
Small organic molecule
Emp. Form.:
C31H41N5O3
Mol. Mass.:
531.6889
SMILES:
CC1CCN(CCC(=O)Nc2ccc3c(O)c4cc(NC(=O)CCN5CCC(C)CC5)ccc4nc3c2)CC1
: