Target
Telomerase reverse transcriptase
Ligand
BDBM50155662
Substrate
Meas. Tech.
ChEMBL_304144 (CHEMBL840260)
EC50
200±n/a nM
Citation
 Harrison, RJReszka, APHaider, SMRomagnoli, BMorrell, JRead, MAGowan, SMIncles, CMKelland, LRNeidle, S Evaluation of by disubstituted acridone derivatives as telomerase inhibitors: the importance of G-quadruplex binding. Bioorg Med Chem Lett 14:5845-9 (2004)  
Target
Name:
Telomerase reverse transcriptase
Synonyms:
EST2 TERT TRT
Type:
PROTEIN
Mol. Mass.:
127099.03
Organism:
Homo sapiens (Human)
Description:
ChEMBL_1447029
Residue:
1132
  
Inhibitor
Name:
BDBM50155662
Synonyms:
3-(2-Hydroxymethyl-piperidin-1-yl)-N-{7-[3-(2-hydroxymethyl-piperidin-1-yl)-propionylamino]-9-oxo-9,10-dihydro-acridin-3-yl}-propionamide | CHEMBL184289
Type:
Small organic molecule
Emp. Form.:
C31H41N5O5
Mol. Mass.:
563.6877
SMILES:
OCC1CCCCN1CCC(=O)Nc1ccc2c(O)c3cc(NC(=O)CCN4CCCCC4CO)ccc3nc2c1
: