Target
Telomerase reverse transcriptase
Ligand
BDBM50155666
Substrate
Meas. Tech.
ChEMBL_304144 (CHEMBL840260)
EC50
2300±n/a nM
Citation
 Harrison, RJReszka, APHaider, SMRomagnoli, BMorrell, JRead, MAGowan, SMIncles, CMKelland, LRNeidle, S Evaluation of by disubstituted acridone derivatives as telomerase inhibitors: the importance of G-quadruplex binding. Bioorg Med Chem Lett 14:5845-9 (2004)  
Target
Name:
Telomerase reverse transcriptase
Synonyms:
EST2 TERT TRT
Type:
PROTEIN
Mol. Mass.:
127099.03
Organism:
Homo sapiens (Human)
Description:
ChEMBL_1447029
Residue:
1132
  
Inhibitor
Name:
BDBM50155666
Synonyms:
3-(4-Hydroxy-piperidin-1-yl)-N-{7-[3-(4-hydroxy-piperidin-1-yl)-propionylamino]-9-oxo-9,10-dihydro-acridin-2-yl}-propionamide CHEMBL365069
Type:
Small organic molecule
Emp. Form.:
C29H37N5O5
Mol. Mass.:
535.6346
SMILES:
OC1CCN(CCC(=O)Nc2ccc3nc4ccc(NC(=O)CCN5CCC(O)CC5)cc4c(O)c3c2)CC1
: