Target
Androgen receptor
Ligand
BDBM50135908
Substrate
Meas. Tech.
ChEMBL_306281 (CHEMBL828424)
IC50
6±n/a nM
Citation
 Cogan, PSKoch, TH Studies of targeting and intracellular trafficking of an anti-androgen doxorubicin-formaldehyde conjugate in PC-3 prostate cancer cells bearing androgen receptor-GFP chimera. J Med Chem 47:5690-9 (2004)  
Target
Name:
Androgen receptor
Synonyms:
ANDR_HUMAN Androgen Receptor Androgen receptor/Baculoviral IAP repeat-containing protein 2 Dihydrotestosterone receptor Nuclear receptor subfamily 3 group C member 4
Type:
Receptor
Mol. Mass.:
99185.27
Organism:
Homo sapiens (Human)
Description:
CHO cells were stably transfected with human AR gene.
Residue:
920
  
Inhibitor
Name:
BDBM50135908
Synonyms:
4-(4,4-Dimethyl-2,5-dioxo-imidazolidin-1-yl)-2-trifluoromethyl-benzonitrile Cyanonilutamide
Type:
Small organic molecule
Emp. Form.:
C13H10F3N3O2
Mol. Mass.:
297.2326
SMILES:
CC1(C)NC(=O)N(C1=O)c1ccc(C#N)c(c1)C(F)(F)F
: