Target
Metabotropic glutamate receptor 5
Ligand
BDBM50156065
Substrate
Meas. Tech.
ChEMBL_304267 (CHEMBL829868)
EC50
40±n/a nM
Citation
 Lindsley, CWWisnoski, DDLeister, WHO'brien, JALemaire, WWilliams, DLBurno, MSur, CKinney, GGPettibone, DJTiller, PRSmith, SDuggan, MEHartman, GDConn, PJHuff, JR Discovery of positive allosteric modulators for the metabotropic glutamate receptor subtype 5 from a series of N-(1,3-diphenyl-1H- pyrazol-5-yl)benzamides that potentiate receptor function in vivo. J Med Chem 47:5825-8 (2004)  
Target
Name:
Metabotropic glutamate receptor 5
Synonyms:
GPRC1E GRM5_HUMAN metabotropic glutamate 5 | metabotropic glutamate 5a
Type:
Enzyme
Mol. Mass.:
132484.72
Organism:
Homo sapiens (Human)
Description:
Residue:
1212
  
Inhibitor
Name:
BDBM50156065
Synonyms:
CHEMBL191039 N-(2,5-Diphenyl-2H-pyrazol-3-yl)-benzamide
Type:
Small organic molecule
Emp. Form.:
C22H17N3O
Mol. Mass.:
339.3899
SMILES:
O=C(Nc1cc(nn1-c1ccccc1)-c1ccccc1)c1ccccc1
: