Target
Cathepsin S
Ligand
BDBM50156086
Substrate
Meas. Tech.
ChEMBL_306474 (CHEMBL829552)
IC50
210±n/a nM
Citation
 Altmann, ECowan-Jacob, SWMissbach, M Novel purine nitrile derived inhibitors of the cysteine protease cathepsin K. J Med Chem 47:5833-6 (2004)  
Target
Name:
Cathepsin S
Synonyms:
CATS_HUMAN Cathepsin S (Cat S) | cathepsin S preproprotein
Type:
Protein
Mol. Mass.:
37507.38
Organism:
Homo sapiens (Human)
Description:
P25774
Residue:
331
  
Inhibitor
Name:
BDBM50156086
Synonyms:
9-CYCLOPENTYL-6-[2-(3-IMIDAZOL-1-YL-PROPOXY)-PHENYLAMINO]-9H-PURINE-2-CARBONITRILE | CHEMBL188865
Type:
Small organic molecule
Emp. Form.:
C23H24N8O
Mol. Mass.:
428.4897
SMILES:
N#Cc1nc(Nc2ccccc2OCCCn2ccnc2)c2ncn(C3CCCC3)c2n1
: