Target
5-hydroxytryptamine receptor 2A
Ligand
BDBM50064708
Substrate
Meas. Tech.
ChEMBL_302664 (CHEMBL839952)
Ki
0.2±n/a nM
Citation
 Glennon, RABondarev, MLKhorana, NYoung, RMay, JAHellberg, MRMcLaughlin, MASharif, NA Beta-oxygenated analogues of the 5-HT2A serotonin receptor agonist 1-(4-bromo-2,5-dimethoxyphenyl)-2-aminopropane. J Med Chem 47:6034-41 (2004)  
Target
Name:
5-hydroxytryptamine receptor 2A
Synonyms:
5-HT-2A 5-HT2A 5-hydroxytryptamine receptor 2A (5HT2A) Htr2 Serotonin Receptor 2A
Type:
G Protein-Coupled Receptor (GPCR)
Mol. Mass.:
52852.05
Organism:
Rattus norvegicus (rat)
Description:
Rat cortex membranes 5-HT2A receptors.
Residue:
471
  
Inhibitor
Name:
BDBM50064708
Synonyms:
(R)-1-(4-bromo-2,5-dimethoxyphenyl)propan-2-amine CHEMBL69700
Type:
Small organic molecule
Emp. Form.:
C11H16BrNO2
Mol. Mass.:
274.154
SMILES:
COc1cc(C[C@@H](C)N)c(OC)cc1Br
: