Target
Prostaglandin G/H synthase 2
Ligand
BDBM22360
Substrate
Meas. Tech.
ChEMBL_305477 (CHEMBL831086)
IC50
2400±n/a nM
Citation
 Uddin, MJPraveen Rao, PNMcDonald, RKnaus, EE A new class of acyclic 2-alkyl-1,1,2-triaryl (Z)-olefins as selective cyclooxygenase-2 inhibitors. J Med Chem 47:6108-11 (2004)  
Target
Name:
Prostaglandin G/H synthase 2
Synonyms:
COX2 Cyclooxygenase-2 (COX-2) PTGS2 Prostaglandin G/H synthase (cyclooxygenase)
Type:
Protein
Mol. Mass.:
68976.98
Organism:
Ovis aries (Sheep)
Description:
Residue:
603
  
Inhibitor
Name:
BDBM22360
Synonyms:
2-(acetyloxy)benzoate Acetylsalicylic acid Endosprin Zorprin cid_2244
Type:
Anti-Inflammatory Agents, Non-Steroidal
Emp. Form.:
C9H8O4
Mol. Mass.:
180.1574
SMILES:
CC(=O)Oc1ccccc1C(O)=O
: