Target
Beta-3 adrenergic receptor
Ligand
BDBM50156267
Substrate
Meas. Tech.
ChEMBL_303404 (CHEMBL839161)
Ki
2.6±n/a nM
Citation
 Sawa, MTateishi, HMizuno, KHarada, HOue, MTsujiuchi, HFurutani, YKato, S Tryptamine-based human beta3-adrenergic receptor agonists. Part 2: SAR of the methylene derivatives. Bioorg Med Chem Lett 14:5963-6 (2004)  
Target
Name:
Beta-3 adrenergic receptor
Synonyms:
ADRB3 ADRB3_HUMAN Beta-2 adrenergic receptor and beta-3 adrenergic receptor Beta-3 adrenoreceptor | adrenergic Beta3
Type:
G Protein-Coupled Receptor (GPCR)
Mol. Mass.:
43534.88
Organism:
Homo sapiens (Human)
Description:
Residue:
408
  
Inhibitor
Name:
BDBM50156267
Synonyms:
3-Amino-N-(3-{(R)-1-hydroxy-2-[2-(7-methanesulfonyl-1H-indol-3-yl)-ethylamino]-ethyl}-phenyl)-benzenesulfonamide | CHEMBL186247
Type:
Small organic molecule
Emp. Form.:
C25H28N4O5S2
Mol. Mass.:
528.644
SMILES:
CS(=O)(=O)c1cccc2c(CCNC[C@H](O)c3cccc(NS(=O)(=O)c4cccc(N)c4)c3)c[nH]c12
: