Target
Beta-3 adrenergic receptor
Ligand
BDBM50156260
Substrate
Meas. Tech.
ChEMBL_310533 (CHEMBL834428)
Ki
4±n/a nM
Citation
 Sawa, MTateishi, HMizuno, KHarada, HOue, MTsujiuchi, HFurutani, YKato, S Tryptamine-based human beta3-adrenergic receptor agonists. Part 2: SAR of the methylene derivatives. Bioorg Med Chem Lett 14:5963-6 (2004)  
Target
Name:
Beta-3 adrenergic receptor
Synonyms:
ADRB3 ADRB3_HUMAN Beta-2 adrenergic receptor and beta-3 adrenergic receptor Beta-3 adrenoreceptor | adrenergic Beta3
Type:
G Protein-Coupled Receptor (GPCR)
Mol. Mass.:
43534.88
Organism:
Homo sapiens (Human)
Description:
Residue:
408
  
Inhibitor
Name:
BDBM50156260
Synonyms:
CHEMBL184407 | Methanesulfonic acid 3-(2-{(R)-(R)-2-hydroxy-2-[3-(thiophene-2-sulfonylamino)-phenyl]-ethylamino}-propyl)-1H-indol-7-yl ester
Type:
Small organic molecule
Emp. Form.:
C24H27N3O6S3
Mol. Mass.:
549.683
SMILES:
C[C@H](Cc1c[nH]c2c(OS(C)(=O)=O)cccc12)NC[C@H](O)c1cccc(NS(=O)(=O)c2cccs2)c1
: