Target
Peroxisomal acyl-coenzyme A oxidase 1
Ligand
BDBM50156430
Substrate
Meas. Tech.
ChEMBL_311972 (CHEMBL834389)
IC50
120±n/a nM
Citation
 Elzein, EIbrahim, PKoltun, DORehder, KShenk, KDMarquart, TAJiang, BLi, XNatero, RLi, YNguyen, MKerwar, SChu, NSoohoo, DHao, JMaydanik, VYLustig, DAZeng, DLeung, KZablocki, JA CVT-4325: a potent fatty acid oxidation inhibitor with favorable oral bioavailability. Bioorg Med Chem Lett 14:6017-21 (2004)  
Target
Name:
Peroxisomal acyl-coenzyme A oxidase 1
Synonyms:
ACOX1_RAT Acox Palmitoyl-CoA oxidase Peroxisomal acyl-CoA oxidase 1, B chain Peroxisomal acyl-coenzyme A oxidase 1
Type:
PROTEIN
Mol. Mass.:
74693.04
Organism:
Rattus norvegicus
Description:
ChEMBL_311972
Residue:
661
  
Inhibitor
Name:
BDBM50156430
Synonyms:
(R)-1-{(S)-4-[5-(2,4-Dichloro-phenyl)-[1,2,4]oxadiazol-3-ylmethyl]-2-methyl-piperazin-1-yl}-3-(2-methyl-benzothiazol-5-yloxy)-propan-2-ol | CHEMBL185174
Type:
Small organic molecule
Emp. Form.:
C25H27Cl2N5O3S
Mol. Mass.:
548.485
SMILES:
C[C@H]1CN(Cc2noc(n2)-c2ccc(Cl)cc2Cl)CCN1C[C@@H](O)COc1ccc2sc(C)nc2c1
: