Target
Mu-type opioid receptor
Ligand
BDBM50157684
Substrate
Meas. Tech.
ChEMBL_430084 (CHEMBL918105)
IC50
>1000±n/a nM
Citation
 Balboni, GSalvadori, SDal Piaz, ABortolotti, FArgazzi, RNegri, LLattanzi, RBryant, SDJinsmaa, YLazarus, LH Highly selective fluorescent analogue of the potent delta-opioid receptor antagonist Dmt-Tic. J Med Chem 47:6541-6 (2004)  
Target
Name:
Mu-type opioid receptor
Synonyms:
M-OR-1 Mu opioid receptor OPIATE Mu OPRM_CAVPO
Type:
Enzyme Catalytic Domain
Mol. Mass.:
11165.58
Organism:
GUINEA PIG
Description:
P97266
Residue:
98
  
Inhibitor
Name:
BDBM50157684
Synonyms:
CHEMBL2369958 | H-Dmt-Tic-Glu-NH2
Type:
Small organic molecule
Emp. Form.:
C26H32N4O6
Mol. Mass.:
496.5555
SMILES:
Cc1cc(O)cc(C)c1C[C@H](N)C(=O)N1Cc2ccccc2C[C@H]1C(=O)N[C@@H](CCC(O)=O)C(N)=O
: