Target
Sphingosine 1-phosphate receptor 2
Ligand
BDBM50158336
Substrate
Meas. Tech.
ChEMBL_430294 (CHEMBL913920)
IC50
>10000±n/a nM
Citation
 Hale, JJLynch, CLNeway, WMills, SGHajdu, RKeohane, CARosenbach, MJMilligan, JAShei, GJParent, SAChrebet, GBergstrom, JCard, DFerrer, MHodder, PStrulovici, BRosen, HMandala, S A rational utilization of high-throughput screening affords selective, orally bioavailable 1-benzyl-3-carboxyazetidine sphingosine-1-phosphate-1 receptor agonists. J Med Chem 47:6662-5 (2004)  
Target
Name:
Sphingosine 1-phosphate receptor 2
Synonyms:
EDG5 S1PR2 Sphingosine 1-phosphate receptor Sphingosine-1-phosphate receptor 2 | ndothelial differentiation G-protein coupled receptor 5
Type:
G Protein-Coupled Receptor (GPCR)
Mol. Mass.:
38883.16
Organism:
Homo sapiens (Human)
Description:
Membranes isolated from S1P2-transfected CHO cells were used in ligand binding assay.
Residue:
353
  
Inhibitor
Name:
BDBM50158336
Synonyms:
2-(4-octylphenethyl)-2-aminopropane-1,3-diol 2-amino-2-(4-octylphenethyl)propane-1,3-diol CHEMBL314854 FINGOLIMOD HYDROCHLORIDE
Type:
Small organic molecule
Emp. Form.:
C19H33NO2
Mol. Mass.:
307.4708
SMILES:
CCCCCCCCc1ccc(CCC(N)(CO)CO)cc1
: