Target
Transient receptor potential cation channel subfamily V member 1
Ligand
BDBM20464
Substrate
Meas. Tech.
ChEMBL_312864 (CHEMBL874942)
IC50
1±n/a nM
Citation
 Doherty, EMFotsch, CBo, YChakrabarti, PPChen, NGavva, NHan, NKelly, MGKincaid, JKlionsky, LLiu, QOgnyanov, VITamir, RWang, XZhu, JNorman, MHTreanor, JJ Discovery of potent, orally available vanilloid receptor-1 antagonists. Structure-activity relationship of N-aryl cinnamides. J Med Chem 48:71-90 (2005)  
Target
Name:
Transient receptor potential cation channel subfamily V member 1
Synonyms:
Capsaicin receptor Osm-9-like TRP channel 1 TRPV1_HUMAN Transient receptor potential cation channel subfamily V member 1 (TRPV1) Transient receptor potential cation channel subfamily V member 1(TRPV1) Vanilloid VR1 Vanilloid receptor 1 Vanilloid receptor 1 (VRI/TRPV1)
Type:
Protein
Mol. Mass.:
94960.75
Organism:
Homo sapiens (Human)
Description:
Q8NER1
Residue:
839
  
Inhibitor
Name:
BDBM20464
Synonyms:
(2E)-3-[2-(piperidin-1-yl)-6-(trifluoromethyl)pyridin-3-yl]-N-(quinolin-7-yl)prop-2-enamide CHEMBL190874
Type:
Small organic molecule
Emp. Form.:
C23H21F3N4O
Mol. Mass.:
426.4342
SMILES:
FC(F)(F)c1ccc(\C=C\C(=O)Nc2ccc3cccnc3c2)c(n1)N1CCCCC1
: