Target
Adenosine receptor A3
Ligand
BDBM50158778
Substrate
Meas. Tech.
ChEMBL_302754 (CHEMBL838701)
Ki
55±n/a nM
Citation
 Moro, SBraiuca, PDeflorian, FFerrari, CPastorin, GCacciari, BBaraldi, PGVarani, KBorea, PASpalluto, G Combined target-based and ligand-based drug design approach as a tool to define a novel 3D-pharmacophore model of human A3 adenosine receptor antagonists: pyrazolo[4,3-e]1,2,4-triazolo[1,5-c]pyrimidine derivatives as a key study. J Med Chem 48:152-62 (2005)  
Target
Name:
Adenosine receptor A3
Synonyms:
A3 adenosine receptor (hA3) ADORA3 | Adenosine A3 receptor (A3AR)
Type:
G Protein-Coupled Receptor (GPCR)
Mol. Mass.:
36197.32
Organism:
Homo sapiens (Human)
Description:
P0DMS8
Residue:
318
  
Inhibitor
Name:
BDBM50158778
Synonyms:
1-[2-Furan-2-yl-8-(3-phenyl-propyl)-8H-pyrazolo[4,3-e][1,2,4]triazolo[1,5-c]pyrimidin-5-yl]-3-isopropyl-urea | CHEMBL366864
Type:
Small organic molecule
Emp. Form.:
C23H24N8O2
Mol. Mass.:
444.4891
SMILES:
CC(C)NC(=O)Nc1nc2nn(CCCc3ccccc3)cc2c2nc(nn12)-c1ccco1
: