Target
Translocator protein
Ligand
BDBM50159075
Substrate
Meas. Tech.
ChEMBL_303739 (CHEMBL829782)
Ki
2.5±n/a nM
Citation
 Trapani, GLaquintana, VDenora, NTrapani, ALopedota, ALatrofa, AFranco, MSerra, MPisu, MGFloris, ISanna, EBiggio, GLiso, G Structure-activity relationships and effects on neuroactive steroid synthesis in a series of 2-phenylimidazo[1,2-a]pyridineacetamide peripheral benzodiazepine receptors ligands. J Med Chem 48:292-305 (2005)  
Target
Name:
Translocator protein
Synonyms:
Benzodiazepine receptors; peripheral & central Mbr PBR Peripheral benzodiazepine receptor (PBR) TSPO_RAT | Tspo
Type:
Mitochondrion membrane protein
Mol. Mass.:
18945.84
Organism:
Rattus norvegicus (rat)
Description:
Competitive binding experiments were performed on rat kidney mitochondrial membranes.
Residue:
169
  
Inhibitor
Name:
BDBM50159075
Synonyms:
CHEMBL180210 | N-Butyl-2-[6,8-dichloro-2-(4-chloro-phenyl)-imidazo[1,2-a]pyridin-3-yl]-N-methyl-acetamide
Type:
Small organic molecule
Emp. Form.:
C20H20Cl3N3O
Mol. Mass.:
424.751
SMILES:
CCCCN(C)C(=O)Cc1c(nc2c(Cl)cc(Cl)cn12)-c1ccc(Cl)cc1
: