Target
Tubulin beta-2B chain
Ligand
BDBM50120462
Substrate
Meas. Tech.
ChEMBL_302732 (CHEMBL838680)
Ki
14000±n/a nM
Citation
 Banerjee, MPoddar, AMitra, GSurolia, AOwa, TBhattacharyya, B Sulfonamide drugs binding to the colchicine site of tubulin: thermodynamic analysis of the drug-tubulin interactions by isothermal titration calorimetry. J Med Chem 48:547-55 (2005)  
Target
Name:
Tubulin beta-2B chain
Synonyms:
TBB2B_BOVIN Tubulin | Tubulin beta chain
Type:
PROTEIN
Mol. Mass.:
49932.38
Organism:
Bos taurus
Description:
ChEMBL_211651
Residue:
445
  
Inhibitor
Name:
BDBM50120462
Synonyms:
CHEMBL20289 | N-(3-Chloro-1H-indol-7-yl)-4-methoxy-benzenesulfonamide
Type:
Small organic molecule
Emp. Form.:
C15H13ClN2O3S
Mol. Mass.:
336.793
SMILES:
COc1ccc(cc1)S(=O)(=O)Nc1cccc2c(Cl)c[nH]c12
: