Target
DNA-dependent protein kinase catalytic subunit
Ligand
BDBM50159605
Substrate
Meas. Tech.
ChEMBL_305785 (CHEMBL827974)
IC50
>10000±n/a nM
Citation
 Griffin, RJFontana, GGolding, BTGuiard, SHardcastle, IRLeahy, JJMartin, NRichardson, CRigoreau, LStockley, MSmith, GC Selective benzopyranone and pyrimido[2,1-a]isoquinolin-4-one inhibitors of DNA-dependent protein kinase: synthesis, structure-activity studies, and radiosensitization of a human tumor cell line in vitro. J Med Chem 48:569-85 (2005)  
Target
Name:
DNA-dependent protein kinase catalytic subunit
Synonyms:
DNA-PK catalytic subunit DNA-dependent protein kinase (DNA-PK) DNA-dependent protein kinase catalytic subunit (DNA-PK) HYRC PRKDC | PRKDC_HUMAN
Type:
Protein
Mol. Mass.:
469114.78
Organism:
Homo sapiens (Human)
Description:
P78527
Residue:
4128
  
Inhibitor
Name:
BDBM50159605
Synonyms:
2-(4-Nitro-phenyl)-benzo[h]chromen-4-one | CHEMBL179925
Type:
Small organic molecule
Emp. Form.:
C19H11NO4
Mol. Mass.:
317.2949
SMILES:
[O-][N+](=O)c1ccc(cc1)-c1cc(=O)c2ccc3ccccc3c2o1
: