Target
Adenosine receptor A2b
Ligand
BDBM10847
Substrate
Meas. Tech.
ChEMBL_303539 (CHEMBL839652)
Ki
7059.0±n/a nM
Citation
 Zablocki, JKalla, RPerry, TPalle, VVarkhedkar, VXiao, DPiscopio, AMaa, TGimbel, AHao, JChu, NLeung, KZeng, D The discovery of a selective, high affinity A(2B) adenosine receptor antagonist for the potential treatment of asthma. Bioorg Med Chem Lett 15:609-12 (2005)  
Target
Name:
Adenosine receptor A2b
Synonyms:
AA2BR_HUMAN ADORA2B Adenosine receptors A2b | Adenosine receptors; A2a & A2b
Type:
G Protein-Coupled Receptor (GPCR)
Mol. Mass.:
36341.22
Organism:
Homo sapiens (Human)
Description:
Residue:
332
  
Inhibitor
Name:
BDBM10847
Synonyms:
1,3-dimethyl-2,3,6,7-tetrahydro-1H-purine-2,6-dione Afonilum Aminophylline Cardophyllin Theophy-lline Theophylline (1,3-dimethylxanthine)
Type:
Small organic molecule
Emp. Form.:
C7H8N4O2
Mol. Mass.:
180.164
SMILES:
Cn1c2nc[nH]c2c(=O)n(C)c1=O
: