Target
Metabotropic glutamate receptor 5
Ligand
BDBM50160632
Substrate
Meas. Tech.
ChEMBL_306712 (CHEMBL833036)
IC50
5±n/a nM
Citation
 Alagille, DBaldwin, RMRoth, BLWroblewski, JTGrajkowska, ETamagnan, GD Functionalization at position 3 of the phenyl ring of the potent mGluR5 noncompetitive antagonists MPEP. Bioorg Med Chem Lett 15:945-9 (2005)  
Target
Name:
Metabotropic glutamate receptor 5
Synonyms:
GRM5_RAT Grm5 Mglur5 metabotropic glutamate 5/1-C metabotropic glutamate 5a
Type:
Enzyme
Mol. Mass.:
131900.14
Organism:
Rattus norvegicus (Rat)
Description:
P31424
Residue:
1203
  
Inhibitor
Name:
BDBM50160632
Synonyms:
3-(6-Methyl-pyridin-2-ylethynyl)-benzonitrile CHEMBL181483
Type:
Small organic molecule
Emp. Form.:
C15H10N2
Mol. Mass.:
218.2533
SMILES:
Cc1cccc(n1)C#Cc1cccc(c1)C#N
: