Target
Caspase-1
Ligand
BDBM50160967
Substrate
Meas. Tech.
ChEMBL_305650 (CHEMBL829508)
IC50
0.890000±n/a nM
Citation
 Han, YGiroux, AColucci, JBayly, CIMckay, DJRoy, SXanthoudakis, SVaillancourt, JRasper, DMTam, JTawa, PNicholson, DWZamboni, RJ Novel pyrazinone mono-amides as potent and reversible caspase-3 inhibitors. Bioorg Med Chem Lett 15:1173-80 (2005)  
Target
Name:
Caspase-1
Synonyms:
CASP1 Caspase ICE IL1BCE Interleukin-1 beta-converting enzyme
Type:
Enzyme
Mol. Mass.:
45154.13
Organism:
Homo sapiens (Human)
Description:
P29466
Residue:
404
  
Inhibitor
Name:
BDBM50160967
Synonyms:
(S)-5-(Dimethylaminomethyl-amino)-3-(2-{3-[(4-methyl-furazan-3-ylmethyl)-amino]-2-oxo-2H-pyrazin-1-yl}-butyrylamino)-4-oxo-pentanoic acid | CHEMBL181027
Type:
Small organic molecule
Emp. Form.:
C20H30N8O6
Mol. Mass.:
478.5022
SMILES:
CCC(C(=O)N[C@@H](CC(O)=O)C(=O)CNCN(C)C)n1ccnc(NCc2nonc2C)c1=O
: