Target
Caspase-8
Ligand
BDBM50160980
Substrate
Meas. Tech.
ChEMBL_305653 (CHEMBL829511)
IC50
4.9±n/a nM
Citation
 Han, YGiroux, AColucci, JBayly, CIMckay, DJRoy, SXanthoudakis, SVaillancourt, JRasper, DMTam, JTawa, PNicholson, DWZamboni, RJ Novel pyrazinone mono-amides as potent and reversible caspase-3 inhibitors. Bioorg Med Chem Lett 15:1173-80 (2005)  
Target
Name:
Caspase-8
Synonyms:
Apoptotic cysteine protease CAP4 CASP8 Caspase Caspase-8 subunit p18 FADD-like ICE ICE-like apoptotic protease 5 MCH5 | MORT1-associated CED-3 homolog
Type:
Enzyme
Mol. Mass.:
55373.89
Organism:
Homo sapiens (Human)
Description:
Q14790
Residue:
479
  
Inhibitor
Name:
BDBM50160980
Synonyms:
(S)-5-Benzylsulfanyl-4-oxo-3-(2-{2-oxo-3-[(5-phenyl-[1,3,4]oxadiazol-2-ylmethyl)-amino]-2H-pyrazin-1-yl}-butyrylamino)-pentanoic acid | CHEMBL220238
Type:
Small organic molecule
Emp. Form.:
C29H30N6O6S
Mol. Mass.:
590.65
SMILES:
CCC(C(=O)N[C@@H](CC(O)=O)C(=O)CSCc1ccccc1)n1ccnc(NCc2nnc(o2)-c2ccccc2)c1=O
: