Target
Caspase-8
Ligand
BDBM50160976
Substrate
Meas. Tech.
ChEMBL_305653 (CHEMBL829511)
IC50
5.3±n/a nM
Citation
 Han, YGiroux, AColucci, JBayly, CIMckay, DJRoy, SXanthoudakis, SVaillancourt, JRasper, DMTam, JTawa, PNicholson, DWZamboni, RJ Novel pyrazinone mono-amides as potent and reversible caspase-3 inhibitors. Bioorg Med Chem Lett 15:1173-80 (2005)  
Target
Name:
Caspase-8
Synonyms:
Apoptotic cysteine protease CAP4 CASP8 Caspase Caspase-8 subunit p18 FADD-like ICE ICE-like apoptotic protease 5 MCH5 | MORT1-associated CED-3 homolog
Type:
Enzyme
Mol. Mass.:
55373.89
Organism:
Homo sapiens (Human)
Description:
Q14790
Residue:
479
  
Inhibitor
Name:
BDBM50160976
Synonyms:
(3S)-3-(2-(5-tert-butyl-3-((4-methyl-1,2,5-oxadiazol-3-yl)methylamino)-2-oxopyrazin-1(2H)-yl)butanamido)-4-oxo-7-phenylheptanoic acid CHEMBL180623
Type:
Small organic molecule
Emp. Form.:
C29H38N6O6
Mol. Mass.:
566.6486
SMILES:
CCC(C(=O)N[C@@H](CC(O)=O)C(=O)CCCc1ccccc1)n1cc(nc(NCc2nonc2C)c1=O)C(C)(C)C
: