Target
Caspase-7
Ligand
BDBM50160950
Substrate
Meas. Tech.
ChEMBL_305652 (CHEMBL829510)
IC50
0.140000±n/a nM
Citation
 Han, YGiroux, AColucci, JBayly, CIMckay, DJRoy, SXanthoudakis, SVaillancourt, JRasper, DMTam, JTawa, PNicholson, DWZamboni, RJ Novel pyrazinone mono-amides as potent and reversible caspase-3 inhibitors. Bioorg Med Chem Lett 15:1173-80 (2005)  
Target
Name:
Caspase-7
Synonyms:
Apoptotic protease Mch-3 CASP7 CMH-1 MCH3 | caspase 7, apoptosis-related cysteine peptidase
Type:
Enzyme
Mol. Mass.:
34273.91
Organism:
Homo sapiens (Human)
Description:
P55210
Residue:
303
  
Inhibitor
Name:
BDBM50160950
Synonyms:
(S)-5-{[(Hexyl-methyl-amino)-methyl]-amino}-3-(2-{3-[(4-methyl-furazan-3-ylmethyl)-amino]-2-oxo-2H-pyrazin-1-yl}-butyrylamino)-4-oxo-pentanoic acid | CHEMBL359598
Type:
Small organic molecule
Emp. Form.:
C25H40N8O6
Mol. Mass.:
548.6351
SMILES:
CCCCCCN(C)CNCC(=O)[C@H](CC(O)=O)NC(=O)C(CC)n1ccnc(NCc2nonc2C)c1=O
: