Target
Caspase-1
Ligand
BDBM50160987
Substrate
Meas. Tech.
ChEMBL_305650 (CHEMBL829508)
IC50
0.110000±n/a nM
Citation
 Han, YGiroux, AColucci, JBayly, CIMckay, DJRoy, SXanthoudakis, SVaillancourt, JRasper, DMTam, JTawa, PNicholson, DWZamboni, RJ Novel pyrazinone mono-amides as potent and reversible caspase-3 inhibitors. Bioorg Med Chem Lett 15:1173-80 (2005)  
Target
Name:
Caspase-1
Synonyms:
CASP1 Caspase ICE IL1BCE Interleukin-1 beta-converting enzyme
Type:
Enzyme
Mol. Mass.:
45154.13
Organism:
Homo sapiens (Human)
Description:
P29466
Residue:
404
  
Inhibitor
Name:
BDBM50160987
Synonyms:
(S)-3-(2-{5-tert-Butyl-3-[(4-methyl-furazan-3-ylmethyl)-amino]-2-oxo-2H-pyrazin-1-yl}-butyrylamino)-5-{[(methyl-pentyl-amino)-methyl]-amino}-4-oxo-pentanoic acid | CHEMBL180669
Type:
Small organic molecule
Emp. Form.:
C28H46N8O6
Mol. Mass.:
590.7148
SMILES:
CCCCCN(C)CNCC(=O)[C@H](CC(O)=O)NC(=O)C(CC)n1cc(nc(NCc2nonc2C)c1=O)C(C)(C)C
: