Target
Steryl-sulfatase
Ligand
BDBM50161118
Substrate
Meas. Tech.
ChEMBL_302806 (CHEMBL838514)
Ki
14500±n/a nM
Citation
 Lehr, PBillich, AWolff, BNussbaumer, P N-Acyl arylsulfonamides as novel, reversible inhibitors of human steroid sulfatase. Bioorg Med Chem Lett 15:1235-8 (2005)  
Target
Name:
Steryl-sulfatase
Synonyms:
ARSC1 Arylsulfatase C STS_HUMAN Steryl-sulfate sulfohydrolase
Type:
Enzyme
Mol. Mass.:
65503.66
Organism:
Homo sapiens (Human)
Description:
P08842
Residue:
583
  
Inhibitor
Name:
BDBM50161118
Synonyms:
4-(4-Chloro-benzenesulfonylaminocarbonyl)-piperazine-1-carboxylic acid tert-butyl ester | CHEMBL361614
Type:
Small organic molecule
Emp. Form.:
C16H22ClN3O5S
Mol. Mass.:
403.881
SMILES:
CC(C)(C)OC(=O)N1CCN(CC1)C(=O)NS(=O)(=O)c1ccc(Cl)cc1
: