Target
Mitogen-activated protein kinase 14
Ligand
BDBM13533
Substrate
Meas. Tech.
ChEMBL_325097 (CHEMBL860914)
Kd
0.240000±n/a nM
Citation
 Fabian, MABiggs, WHTreiber, DKAtteridge, CEAzimioara, MDBenedetti, MGCarter, TACiceri, PEdeen, PTFloyd, MFord, JMGalvin, MGerlach, JLGrotzfeld, RMHerrgard, SInsko, DEInsko, MALai, AGLélias, JMMehta, SAMilanov, ZVVelasco, AMWodicka, LMPatel, HKZarrinkar, PPLockhart, DJ A small molecule-kinase interaction map for clinical kinase inhibitors. Nat Biotechnol 23:329-36 (2005)  
Target
Name:
Mitogen-activated protein kinase 14
Synonyms:
CSAID-binding protein CSBP1 CSPB1 MAP kinase 14 MAP kinase p38 alpha MAPK14 MK14_HUMAN Mitogen-activated protein kinase p38 alpha Stress-activated protein kinase 2a | p38 MAP kinase alpha/beta
Type:
Serine/threonine-protein kinase
Mol. Mass.:
41286.76
Organism:
Homo sapiens (Human)
Description:
Q16539
Residue:
360
  
Inhibitor
Name:
BDBM13533
Synonyms:
1-[2-(4-methylphenyl)-5-tert-butyl-pyrazol-3-yl]-3-[4-(2-morpholin-4-ylethoxy)naphthalen-1-yl]urea 1-[5-tert-butyl-2-(4-methylphenyl)pyrazol-3-yl]-3-[4-(2-morpholin-4-ylethoxy)naphthalen-1-yl]urea 3-[2-(4-methylphenyl)-5-tert-butyl-pyrazol-3-yl]-1-[4-(2-morpholin-4-ylethoxy)naphthalen-1-yl]urea BIRB 796 BIRB-796, 3 D3RKN_73 US11407771, Compound 43 US9187470, 43 (BIRB-796) US9260410, BIRB796 diaryl urea compound 10
Type:
Small organic molecule
Emp. Form.:
C31H37N5O3
Mol. Mass.:
527.6572
SMILES:
Cc1ccc(cc1)-n1nc(cc1NC(=O)Nc1ccc(OCCN2CCOCC2)c2ccccc12)C(C)(C)C
: