Target
Cyclin-G-associated kinase
Ligand
BDBM13531
Substrate
Meas. Tech.
ChEMBL_325053 (CHEMBL860789)
Kd
650±n/a nM
Citation
 Fabian, MABiggs, WHTreiber, DKAtteridge, CEAzimioara, MDBenedetti, MGCarter, TACiceri, PEdeen, PTFloyd, MFord, JMGalvin, MGerlach, JLGrotzfeld, RMHerrgard, SInsko, DEInsko, MALai, AGLélias, JMMehta, SAMilanov, ZVVelasco, AMWodicka, LMPatel, HKZarrinkar, PPLockhart, DJ A small molecule-kinase interaction map for clinical kinase inhibitors. Nat Biotechnol 23:329-36 (2005)  
Target
Name:
Cyclin-G-associated kinase
Synonyms:
GAK Serine/threonine-protein kinase GAK
Type:
PROTEIN
Mol. Mass.:
143171.28
Organism:
Homo sapiens (Human)
Description:
ChEMBL_1478229
Residue:
1311
  
Inhibitor
Name:
BDBM13531
Synonyms:
4-(4-Fluorophenyl)-2-(4-hydroxyphenyl)-5-(4-pyridyl)-1H-imidazole 4-[4-(4-fluorophenyl)-5-(4-pyridyl)-4-imidazolin-2-ylidene]cyclohexa-2,5-dien-1-one SB-202190 biotinylated SB202190
Type:
Small organic molecule
Emp. Form.:
C20H14FN3O
Mol. Mass.:
331.3431
SMILES:
Oc1ccc(cc1)-c1nc(c([nH]1)-c1ccc(F)cc1)-c1ccncc1
: