Target
STE20-like serine/threonine-protein kinase
Ligand
BDBM31090
Substrate
Meas. Tech.
ChEMBL_325019 (CHEMBL860653)
Kd
250±n/a nM
Citation
 Fabian, MABiggs, WHTreiber, DKAtteridge, CEAzimioara, MDBenedetti, MGCarter, TACiceri, PEdeen, PTFloyd, MFord, JMGalvin, MGerlach, JLGrotzfeld, RMHerrgard, SInsko, DEInsko, MALai, AGLélias, JMMehta, SAMilanov, ZVVelasco, AMWodicka, LMPatel, HKZarrinkar, PPLockhart, DJ A small molecule-kinase interaction map for clinical kinase inhibitors. Nat Biotechnol 23:329-36 (2005)  
Target
Name:
STE20-like serine/threonine-protein kinase
Synonyms:
KIAA0204 SLK_HUMAN Serine/threonine-protein kinase 2
Type:
PROTEIN
Mol. Mass.:
142644.38
Organism:
Homo sapiens (Human)
Description:
ChEMBL_1451342
Residue:
1235
  
Inhibitor
Name:
BDBM31090
Synonyms:
(E)-N-[4-(3-chloro-4-fluoro-anilino)-3-cyano-7-ethoxy-6-quinolyl]-4-(dimethylamino)but-2-enamide (E)-N-[4-(3-chloro-4-fluoroanilino)-3-cyano-7-ethoxyquinolin-6-yl]-4-(dimethylamino)but-2-enamide EKB-569 cid_6445562
Type:
Small organic molecule
Emp. Form.:
C24H23ClFN5O2
Mol. Mass.:
467.923
SMILES:
CCOc1cc2ncc(C#N)c(Nc3ccc(F)c(Cl)c3)c2cc1NC(=O)\C=C\CN(C)C
: