Target
Caspase-6
Ligand
BDBM50161452
Substrate
Meas. Tech.
ChEBML_304684
IC50
50±n/a nM
Citation
 Wang, YGuan, LJia, STseng, BDrewe, JCai, SX Dipeptidyl aspartyl fluoromethylketones as potent caspase inhibitors: peptidomimetic replacement of the P2 alpha-amino acid by a alpha-hydroxy acid. Bioorg Med Chem Lett 15:1379-83 (2005)  
Target
Name:
Caspase-6
Synonyms:
Apoptotic protease Mch-2 CASP6 Caspase | MCH2
Type:
Enzyme
Mol. Mass.:
33312.62
Organism:
Homo sapiens (Human)
Description:
P55212
Residue:
293
  
Inhibitor
Name:
BDBM50161452
Synonyms:
5-Fluoro-3-((S)-3-methyl-2-phenylcarbamoyloxy-butyrylamino)-4-oxo-pentanoic acid | CHEMBL180263
Type:
Small organic molecule
Emp. Form.:
C17H21FN2O6
Mol. Mass.:
368.3568
SMILES:
CC(C)[C@H](OC(=O)Nc1ccccc1)C(=O)NC(CC(O)=O)C(=O)CF
: