Target
Thromboxane A2 receptor
Ligand
BDBM50161745
Substrate
Meas. Tech.
ChEMBL_312964 (CHEMBL827477)
IC50
>10000±n/a nM
Citation
 Ulven, TKostenis, E Minor structural modifications convert the dual TP/CRTH2 antagonist ramatroban into a highly selective and potent CRTH2 antagonist. J Med Chem 48:897-900 (2005)  
Target
Name:
Thromboxane A2 receptor
Synonyms:
Prostanoid TP receptor TBXA2R Thromboxane Thromboxane Beta
Type:
Enyzme
Mol. Mass.:
37445.28
Organism:
Homo sapiens (Human)
Description:
P21731
Residue:
343
  
Inhibitor
Name:
BDBM50161745
Synonyms:
CHEMBL179036 | {3-[((R)-4-Fluoro-benzenesulfonyl)-methyl-amino]-1,2,3,4-tetrahydro-carbazol-9-yl}-acetic acid
Type:
Small organic molecule
Emp. Form.:
C21H21FN2O4S
Mol. Mass.:
416.466
SMILES:
CN([C@@H]1CCc2c(C1)c1ccccc1n2CC(O)=O)S(=O)(=O)c1ccc(F)cc1
: