Target
Thymidylate synthase
Ligand
BDBM50161775
Substrate
Meas. Tech.
ChEMBL_302848 (CHEMBL827892)
Ki
0.5±n/a nM
Citation
 Tondi, DVenturelli, AFerrari, SGhelli, SCosti, MP Improving specificity vs bacterial thymidylate synthases through N-dansyl modulation of didansyltyrosine. J Med Chem 48:913-6 (2005)  
Target
Name:
Thymidylate synthase
Synonyms:
TSase Thymidylate Synthase (TS) thyA
Type:
Enzyme
Mol. Mass.:
36576.54
Organism:
Lactobacillus casei
Description:
Residue:
316
  
Inhibitor
Name:
BDBM50161775
Synonyms:
(S)-2-(6-Amino-naphthalene-1-sulfonylamino)-3-[4-(5-dimethylamino-naphthalene-1-sulfonyloxy)-phenyl]-propionic acid | CHEMBL360335
Type:
Small organic molecule
Emp. Form.:
C31H29N3O7S2
Mol. Mass.:
619.708
SMILES:
CN(C)c1cccc2c(cccc12)S(=O)(=O)Oc1ccc(C[C@H](NS(=O)(=O)c2cccc3cc(N)ccc23)C(O)=O)cc1
: