Target
Thymidylate synthase
Ligand
BDBM50161780
Substrate
Meas. Tech.
ChEMBL_302477 (CHEMBL875209)
Ki
11±n/a nM
Citation
 Tondi, DVenturelli, AFerrari, SGhelli, SCosti, MP Improving specificity vs bacterial thymidylate synthases through N-dansyl modulation of didansyltyrosine. J Med Chem 48:913-6 (2005)  
Target
Name:
Thymidylate synthase
Synonyms:
TS TYMS Thymidylate synthase (TS) | Thymidylate synthase/GAR transformylase/AICAR transformylase
Type:
Enzyme
Mol. Mass.:
35718.07
Organism:
Homo sapiens (Human)
Description:
Residue:
313
  
Inhibitor
Name:
BDBM50161780
Synonyms:
(S)-2-(4-Benzyloxycarbonylamino-naphthalene-1-sulfonylamino)-3-[4-(5-dimethylamino-naphthalene-1-sulfonyloxy)-phenyl]-propionic acid | CHEMBL425692
Type:
Small organic molecule
Emp. Form.:
C39H35N3O9S2
Mol. Mass.:
753.84
SMILES:
CN(C)c1cccc2c(cccc12)S(=O)(=O)Oc1ccc(C[C@H](NS(=O)(=O)c2ccc(NC(=O)OCc3ccccc3)c3ccccc23)C(O)=O)cc1
: