Target
Vascular endothelial growth factor receptor 2
Ligand
BDBM50162143
Substrate
Meas. Tech.
ChEMBL_305183 (CHEMBL876146)
IC50
0.200000±n/a nM
Citation
 Kubo, KShimizu, TOhyama, SMurooka, HIwai, ANakamura, KHasegawa, KKobayashi, YTakahashi, NTakahashi, KKato, SIzawa, TIsoe, T Novel potent orally active selective VEGFR-2 tyrosine kinase inhibitors: synthesis, structure-activity relationships, and antitumor activities of N-phenyl-N'-{4-(4-quinolyloxy)phenyl}ureas. J Med Chem 48:1359-66 (2005)  
Target
Name:
Vascular endothelial growth factor receptor 2
Synonyms:
CD_antigen=CD309 Fetal liver kinase 1 (FLK-1) KDR Protein-tyrosine kinase receptor Flk-1 VEGFR-2 VEGFR2 Vascular Endothelial Growth Factor Receptor Kinase 2 Vascular endothelial growth factor receptor 2 (KDR) Vascular endothelial growth factor receptor 2 (VEGFR2) Vascular endothelial growth factor receptor-2 (VEGFR-2)
Type:
Receptor Tyrosine Kinase
Mol. Mass.:
151510.97
Organism:
Homo sapiens (Human)
Description:
P35968
Residue:
1356
  
Inhibitor
Name:
BDBM50162143
Synonyms:
1-[4-(6,7-Dimethoxy-quinolin-4-yloxy)-phenyl]-3-m-tolyl-urea | CHEMBL369760
Type:
Small organic molecule
Emp. Form.:
C25H23N3O4
Mol. Mass.:
429.4678
SMILES:
COc1cc2nccc(Oc3ccc(NC(=O)Nc4cccc(C)c4)cc3)c2cc1OC
: