Target
Cathepsin S
Ligand
BDBM50162822
Substrate
Meas. Tech.
ChEBML_305074
IC50
10±n/a nM
Citation
 Gustin, DJSehon, CAWei, JCai, HMeduna, SPKhatuya, HSun, SGu, YJiang, WThurmond, RLKarlsson, LEdwards, JP Discovery and SAR studies of a novel series of noncovalent cathepsin S inhibitors. Bioorg Med Chem Lett 15:1687-91 (2005)  
Target
Name:
Cathepsin S
Synonyms:
CATS_HUMAN Cathepsin S (Cat S) | cathepsin S preproprotein
Type:
Protein
Mol. Mass.:
37507.38
Organism:
Homo sapiens (Human)
Description:
P25774
Residue:
331
  
Inhibitor
Name:
BDBM50162822
Synonyms:
1-(1-{3-[3-(3,4-Dichloro-phenyl)-5-methanesulfonyl-4,5,6,7-tetrahydro-pyrazolo[4,3-c]pyridin-1-yl]-propyl}-piperidin-4-yl)-1,3-dihydro-benzoimidazol-2-one | CHEMBL361095
Type:
Small organic molecule
Emp. Form.:
C28H32Cl2N6O3S
Mol. Mass.:
603.563
SMILES:
CS(=O)(=O)N1CCc2c(C1)c(nn2CCCN1CCC(CC1)n1c2ccccc2[nH]c1=O)-c1ccc(Cl)c(Cl)c1
: