Target
Cathepsin S
Ligand
BDBM50162839
Substrate
Meas. Tech.
ChEBML_305074
IC50
60±n/a nM
Citation
 Gustin, DJSehon, CAWei, JCai, HMeduna, SPKhatuya, HSun, SGu, YJiang, WThurmond, RLKarlsson, LEdwards, JP Discovery and SAR studies of a novel series of noncovalent cathepsin S inhibitors. Bioorg Med Chem Lett 15:1687-91 (2005)  
Target
Name:
Cathepsin S
Synonyms:
CATS_HUMAN Cathepsin S (Cat S) | cathepsin S preproprotein
Type:
Protein
Mol. Mass.:
37507.38
Organism:
Homo sapiens (Human)
Description:
P25774
Residue:
331
  
Inhibitor
Name:
BDBM50162839
Synonyms:
1-(1-{3-[3-(4-Chloro-3-methyl-phenyl)-5-methanesulfonyl-4,5,6,7-tetrahydro-pyrazolo[4,3-c]pyridin-1-yl]-2-hydroxy-propyl}-piperidin-4-yl)-1,3-dihydro-benzoimidazol-2-one | CHEMBL360017
Type:
Small organic molecule
Emp. Form.:
C29H35ClN6O4S
Mol. Mass.:
599.144
SMILES:
Cc1cc(ccc1Cl)-c1nn(CC(O)CN2CCC(CC2)n2c3ccccc3[nH]c2=O)c2CCN(Cc12)S(C)(=O)=O
: