Target
Cathepsin S
Ligand
BDBM50162843
Substrate
Meas. Tech.
ChEBML_305074
IC50
30±n/a nM
Citation
 Gustin, DJSehon, CAWei, JCai, HMeduna, SPKhatuya, HSun, SGu, YJiang, WThurmond, RLKarlsson, LEdwards, JP Discovery and SAR studies of a novel series of noncovalent cathepsin S inhibitors. Bioorg Med Chem Lett 15:1687-91 (2005)  
Target
Name:
Cathepsin S
Synonyms:
CATS_HUMAN Cathepsin S (Cat S) | cathepsin S preproprotein
Type:
Protein
Mol. Mass.:
37507.38
Organism:
Homo sapiens (Human)
Description:
P25774
Residue:
331
  
Inhibitor
Name:
BDBM50162843
Synonyms:
3-(1-{2-Hydroxy-3-[5-methanesulfonyl-3-(4-trifluoromethyl-phenyl)-4,5,6,7-tetrahydro-pyrazolo[4,3-c]pyridin-1-yl]-propyl}-piperidin-4-yl)-1,5-dimethyl-1,3-dihydro-benzoimidazol-2-one | CHEMBL360969
Type:
Small organic molecule
Emp. Form.:
C31H37F3N6O4S
Mol. Mass.:
646.723
SMILES:
Cc1ccc2n(C)c(=O)n(C3CCN(CC(O)Cn4nc(c5CN(CCc45)S(C)(=O)=O)-c4ccc(cc4)C(F)(F)F)CC3)c2c1
: