Target
Follicle-stimulating hormone receptor
Ligand
BDBM50410300
Substrate
Meas. Tech.
ChEMBL_312853 (CHEMBL874932)
IC50
76±n/a nM
Citation
 van Straten, NCvan Berkel, THDemont, DRKarstens, WJMerkx, ROosterom, JSchulz, Jvan Someren, RGTimmers, CMvan Zandvoort, PM Identification of substituted 6-amino-4-phenyltetrahydroquinoline derivatives: potent antagonists for the follicle-stimulating hormone receptor. J Med Chem 48:1697-700 (2005)  
Target
Name:
Follicle-stimulating hormone receptor
Synonyms:
FSH-R FSHR_HUMAN Follicle-stimulating hormone receptor LGR1
Type:
PROTEIN
Mol. Mass.:
78273.21
Organism:
Homo sapiens (Human)
Description:
ChEMBL_1351769
Residue:
695
  
Inhibitor
Name:
BDBM50410300
Synonyms:
CHEMBL179505
Type:
Small organic molecule
Emp. Form.:
C26H34N2O3
Mol. Mass.:
422.5598
SMILES:
CC(=O)N1c2ccc(NC(=O)COC(C)(C)C)cc2C(C)(CC1(C)C)c1ccccc1
: