Target
Follicle-stimulating hormone receptor
Ligand
BDBM50162936
Substrate
Meas. Tech.
ChEMBL_312853 (CHEMBL874932)
IC50
28±n/a nM
Citation
 van Straten, NCvan Berkel, THDemont, DRKarstens, WJMerkx, ROosterom, JSchulz, Jvan Someren, RGTimmers, CMvan Zandvoort, PM Identification of substituted 6-amino-4-phenyltetrahydroquinoline derivatives: potent antagonists for the follicle-stimulating hormone receptor. J Med Chem 48:1697-700 (2005)  
Target
Name:
Follicle-stimulating hormone receptor
Synonyms:
FSH-R FSHR_HUMAN Follicle-stimulating hormone receptor LGR1
Type:
PROTEIN
Mol. Mass.:
78273.21
Organism:
Homo sapiens (Human)
Description:
ChEMBL_1351769
Residue:
695
  
Inhibitor
Name:
BDBM50162936
Synonyms:
Biphenyl-4-carboxylic acid (1-acetyl-2,2,4-trimethyl-4-phenyl-1,2,3,4-tetrahydro-quinolin-6-yl)-amide | CHEMBL192135
Type:
Small organic molecule
Emp. Form.:
C33H32N2O2
Mol. Mass.:
488.6194
SMILES:
CC(=O)N1c2ccc(NC(=O)c3ccc(cc3)-c3ccccc3)cc2C(C)(CC1(C)C)c1ccccc1
: