Target
Histamine H1 receptor
Ligand
BDBM50162956
Substrate
Meas. Tech.
ChEMBL_303185 (CHEMBL829679)
Ki
0.43±n/a nM
Citation
 Fernández, JAlonso, JMAndrés, JICid, JMDíaz, AIturrino, LGil, PMegens, ASipido, VKTrabanco, AA Discovery of new tetracyclic tetrahydrofuran derivatives as potential broad-spectrum psychotropic agents. J Med Chem 48:1709-12 (2005)  
Target
Name:
Histamine H1 receptor
Synonyms:
H1R HISTAMINE H1 HRH1_HUMAN
Type:
G Protein-Coupled Receptor (GPCR)
Mol. Mass.:
55808.72
Organism:
Homo sapiens (Human)
Description:
Cell pellets from SK-N-MC cells transfected with human H1 receptor were used in binding assay.
Residue:
487
  
Inhibitor
Name:
BDBM50162956
Synonyms:
CHEMBL371352 | Dimethyl-(11-methyl-3,3a,8,12b-tetrahydro-2H-1-oxa-dibenzo[e,h]azulen-2-ylmethyl)-amine
Type:
Small organic molecule
Emp. Form.:
C20H23NO
Mol. Mass.:
293.4027
SMILES:
CN(C)C[C@H]1CC2[C@H](O1)c1ccccc1Cc1ccccc21
: