Target
Neuronal acetylcholine receptor subunit alpha-3/beta-4
Ligand
BDBM50162989
Substrate
Meas. Tech.
ChEMBL_303477 (CHEMBL838851)
Ki
66000±n/a nM
Citation
 Wei, ZLXiao, YYuan, HBaydyuk, MPetukhov, PAMusachio, JLKellar, KJKozikowski, AP Novel pyridyl ring C5 substituted analogues of epibatidine and 3-(1-methyl-2(S)-pyrrolidinylmethoxy)pyridine (A-84543) as highly selective agents for neuronal nicotinic acetylcholine receptors containing beta2 subunits. J Med Chem 48:1721-4 (2005)  
Target
Name:
Neuronal acetylcholine receptor subunit alpha-3/beta-4
Synonyms:
Neuronal acetylcholine receptor Alpha-3/Beta-4 Neuronal acetylcholine receptor; alpha3/beta4 | nAChR subtypes alpha3 beta4
Type:
Protein
Mol. Mass.:
Description:
Components:
This complex has 2 components.
Component 1
Name:
Neuronal acetylcholine receptor subunit alpha-3
Synonyms:
ACHA3_RAT Chrna3
Type:
Enzyme
Mol. Mass.:
56995.52
Organism:
Rattus norvegicus (Rat)
Description:
P04757
Residue:
499
  
Component 2
Name:
Neuronal acetylcholine receptor subunit beta-4
Synonyms:
ACHB4_RAT Chrnb4 Neuronal acetylcholine receptor non-alpha-2 chain | Neuronal acetylcholine receptor protein beta-4 subunit
Type:
Enzyme
Mol. Mass.:
55863.89
Organism:
Rattus norvegicus (Rat)
Description:
P12392
Residue:
495
  
Inhibitor
Name:
BDBM50162989
Synonyms:
10-[5-((S)-1-Methyl-pyrrolidin-2-ylmethoxy)-pyridin-3-yl]-dec-9-yn-1-ol | CHEMBL175639
Type:
Small organic molecule
Emp. Form.:
C21H32N2O2
Mol. Mass.:
344.491
SMILES:
CN1CCC[C@H]1COc1cncc(c1)C#CCCCCCCCCO
: