Target
Fatty-acid amide hydrolase 1 [30-579]
Ligand
BDBM50163152
Substrate
Meas. Tech.
ChEMBL_303638 (CHEMBL828848)
Ki
0.14±n/a nM
Citation
 Boger, DLMiyauchi, HDu, WHardouin, CFecik, RACheng, HHwang, IHedrick, MPLeung, DAcevedo, OGuimarães, CRJorgensen, WLCravatt, BF Discovery of a potent, selective, and efficacious class of reversible alpha-ketoheterocycle inhibitors of fatty acid amide hydrolase effective as analgesics. J Med Chem 48:1849-56 (2005)  
Target
Name:
Fatty-acid amide hydrolase 1 [30-579]
Synonyms:
Anandamide amidohydrolase 1 Faah Fatty Acid Amide Hydrolase Fatty-acid amide hydrolase (FAAH) Fatty-acid amide hydrolase 1 (FAAH) Oleamide hydrolase 1
Type:
Single-pass membrane protein; homodimer
Mol. Mass.:
60474.00
Organism:
Rattus norvegicus (rat)
Description:
P97612 (aa 30-579)
Residue:
550
  
Inhibitor
Name:
BDBM50163152
Synonyms:
1-Oxazolo[4,5-b]pyridin-2-yl-octadec-9-yn-1-one | CHEMBL175580
Type:
Small organic molecule
Emp. Form.:
C24H34N2O2
Mol. Mass.:
382.539
SMILES:
CCCCCCCCC#CCCCCCCCC(=O)c1nc2ncccc2o1
: