Target
Sodium-dependent serotonin transporter
Ligand
BDBM50024304
Substrate
Meas. Tech.
ChEMBL_302646 (CHEMBL839936)
Ki
84±n/a nM
Citation
 Andrés, JIAlcázar, JAlonso, JMAlvarez, RMBakker, MHBiesmans, ICid, JMDe Lucas, AIFernández, JFont, LMHens, KAIturrino, LLenaerts, IMartínez, SMegens, AAPastor, JVermote, PCSteckler, T Discovery of a new series of centrally active tricyclic isoxazoles combining serotonin (5-HT) reuptake inhibition with alpha2-adrenoceptor blocking activity. J Med Chem 48:2054-71 (2005)  
Target
Name:
Sodium-dependent serotonin transporter
Synonyms:
5-HT Transporter 5HTT SC6A4_HUMAN SLC6A4 Serotonin transporter (5HTT) Sodium-dependent serotonin transporter (SERT) | Solute carrier family 6 member 4
Type:
Multi-pass membrane protein
Mol. Mass.:
70322.51
Organism:
Homo sapiens (Human)
Description:
P31645
Residue:
630
  
Inhibitor
Name:
BDBM50024304
Synonyms:
CHEMBL2112981
Type:
Small organic molecule
Emp. Form.:
C24H28N4O
Mol. Mass.:
388.5053
SMILES:
[H][C@@]12CNc3ccccc3C1=NO[C@H]2CN1CCN(C\C=C\c2ccccc2)CC1
: