Target
Sodium-dependent serotonin transporter
Ligand
BDBM50163483
Substrate
Meas. Tech.
ChEMBL_302646 (CHEMBL839936)
Ki
26±n/a nM
Citation
 Andrés, JIAlcázar, JAlonso, JMAlvarez, RMBakker, MHBiesmans, ICid, JMDe Lucas, AIFernández, JFont, LMHens, KAIturrino, LLenaerts, IMartínez, SMegens, AAPastor, JVermote, PCSteckler, T Discovery of a new series of centrally active tricyclic isoxazoles combining serotonin (5-HT) reuptake inhibition with alpha2-adrenoceptor blocking activity. J Med Chem 48:2054-71 (2005)  
Target
Name:
Sodium-dependent serotonin transporter
Synonyms:
5-HT Transporter 5HTT SC6A4_HUMAN SLC6A4 Serotonin transporter (5HTT) Sodium-dependent serotonin transporter (SERT) | Solute carrier family 6 member 4
Type:
Multi-pass membrane protein
Mol. Mass.:
70322.51
Organism:
Homo sapiens (Human)
Description:
P31645
Residue:
630
  
Inhibitor
Name:
BDBM50163483
Synonyms:
CHEMBL175911 | Cyclopropanecarboxylic acid (3R,3aS)-3-[4-((E)-2-methyl-3-phenyl-allyl)-piperazin-1-ylmethyl]-3a,4-dihydro-3H-chromeno[4,3-c]isoxazol-7-yl ester
Type:
Small organic molecule
Emp. Form.:
C29H33N3O4
Mol. Mass.:
487.59
SMILES:
C\C(CN1CCN(C[C@@H]2ON=C3[C@H]2COc2cc(OC(=O)C4CC4)ccc32)CC1)=C/c1ccccc1
: